BDBM50152259 CHEMBL434357::[(S)-1-((S)-1-{(S)-1-[(S)-1-Carbamoyl-2-(1H-indol-3-yl)-ethylcarbamoyl]-4-guanidino-butylcarbamoyl}-2-phenyl-ethylcarbamoyl)-2-(4-chloro-phenyl)-ethyl]-phosphoramidic acid dimethyl ester
SMILES COP(=O)(N[C@@H](Cc1ccc(Cl)cc1)C(=O)N[C@@H](Cc1ccccc1)C(=O)N[C@@H](CCCNC(N)=N)C(=O)N[C@@H](Cc1c[nH]c2ccccc12)C(N)=O)OC
InChI Key InChIKey=FRLWNJNLNAJEOE-YDPTYEFTSA-N
Data  3 EC50
  Tab Delimited (TSV)   2D SDfile   Computed 3D by Vconf -m prep SDfile
Find this compound or compounds like it in BindingDB:
Activity Spreadsheet -- Enzyme Inhibition Constant Data from BindingDB
Found 1 hit for monomerid = 50152259
TargetMelanocortin receptor 4(Homo sapiens (Human))
University Of Cincinnati
Curated by ChEMBL
LigandPNGBDBM50152259(CHEMBL434357 | [(S)-1-((S)-1-{(S)-1-[(S)-1-Carbamo...)
Affinity DataEC50:  137nM. Assay description: Agonistic activity against against human Melanocortin 4 receptor
In DepthDetails ArticlePubMed